Reaction Details
TargetSerine/threonine-protein kinase Sgk1
LigandBDBM50443636
Substrate/Competitorn/a
Meas. Tech.ChEMBL_2158996 (CHEMBL5043746)
IC50 442±n/a nM
Citation Halland, NSchmidt, FWeiss, TLi, ZCzech, JSaas, JDing-Pfennigdorff, DDreyer, MKStrübing, CNazare, M Rational Design of Highly Potent, Selective, and Bioavailable SGK1 Protein Kinase Inhibitors for the Treatment of Osteoarthritis. J Med Chem65:1567-1584 (2022) 
 
Serine/threonine-protein kinase Sgk1
Name:Serine/threonine-protein kinase Sgk1
Type:Other Protein Type
Mol. Mass.:48954.40
Organism:Homo sapiens (Human)
Description:Recombinant human SGK-1 enzyme produced in a baculovirus system.
Residue:431
BDBM50443636
NameBDBM50443636
Synonyms:CHEMBL3092460 US9221828, 1
TypeSmall organic molecule
Emp. Form.C17H12Cl2N6O2S
Mol. Mass.435.287
SMILESNc1n[nH]c2nc(cnc12)-c1ccc(NS(=O)(=O)c2cccc(Cl)c2Cl)cc1