Reaction Details
TargetDimer of Protein farnesyltransferase subunit beta
LigandBDBM50153177
Substrate/Competitorn/a
Meas. Tech.ChEMBL_306501 (CHEMBL828106)
IC50 2.1±n/a nM
Citation Lin, NHWang, LWang, XWang, GTCohen, JGu, WZZhang, HRosenberg, SHSham, HL Synthesis and biological evaluation of 1-benzyl-5-(3-biphenyl-2-yl-propyl)-1H-imidazole as novel farnesyltransferase inhibitor. Bioorg Med Chem Lett14:5057-62 (2004) 
 
Dimer of Protein farnesyltransferase subunit beta
Name:Dimer of Protein farnesyltransferase subunit beta
Synonyms:Protein Farnesyltransferase (PFT) Chain B
Type:n/a
Mol. Mass.:n/a
Description:ASSAY_ID of EBI is 51428
Components:This complex has 3 components.
Component 1
Name:Protein farnesyltransferase subunit beta
Type:Enzyme Subunit
Mol. Mass.:48766.02
Organism:Homo sapiens (Human)
Description:Protein farnesyltransferase subunit beta
Residue:437
Component 2
Name:Protein farnesyltransferase subunit beta
Synonyms:CAAX farnesyltransferase subunit alpha FNTB FTase-alpha GGTase-I-alpha Protein farnesyl/geranylgeranyl transferase Protein farnesyltransferase subunit beta Protein farnesyltransferase/geranylgeranyltransferase type-1 subunit alpha Ras proteins prenyltransferase subunit beta | Type I protein geranyl-geranyltransferase subunit alpha
Type:Enzyme Subunit
Mol. Mass.:48766.02
Organism:Homo sapiens (Human)
Description:Protein farnesyltransferase subunit beta
Residue:437
BDBM50153177
NameBDBM50153177
Synonyms:CHEMBL187809 | N-[3-(4-Cyano-benzyl)-3H-imidazol-4-ylmethyl]-N-(5-cyano-3''-ethoxy-biphenyl-2-ylmethyl)-methanesulfonamide
TypeSmall organic molecule
Emp. Form.C29H27N5O3S
Mol. Mass.525.621
SMILESCCOc1cccc(c1)-c1cc(ccc1CN(Cc1cncn1Cc1ccc(cc1)C#N)S(C)(=O)=O)C#N