Reaction Details
TargetPutative cathepsin L 3
LigandBDBM50153291
Substrate/Competitorn/a
Meas. Tech.ChEMBL_305344 (CHEMBL832724)
IC50>250000±n/a nM
Citation Chircorian, ABarrios, AM Inhibition of lysosomal cysteine proteases by chrysotherapeutic compounds: a possible mechanism for the antiarthritic activity of Au(I). Bioorg Med Chem Lett14:5113-6 (2004) 
 
Putative cathepsin L 3
Name:Putative cathepsin L 3
Type:PROTEIN
Mol. Mass.:35182.45
Organism:Paramecium tetraurelia
Description:ChEMBL_302746
Residue:308
BDBM50153291
NameBDBM50153291
Synonyms:(1-Thio-beta-D-glucopyranosato)(triethylphosphine)gold2,3,4,6-tetraacetate CHEMBL1366 SK&F-39162 | SK-39162
TypeSmall organic molecule
Emp. Form.C20H34AuO9PS
Mol. Mass.678.484
SMILESCC[P+](CC)(CC)[Au-]S[C@@H]1O[C@H](COC(C)=O)[C@@H](OC(C)=O)[C@H](OC(C)=O)[C@H]1OC(C)=O