Reaction Details
TargetPutative cathepsin L 3
LigandBDBM50153289
Substrate/Competitorn/a
Meas. Tech.ChEMBL_302746 (CHEMBL852353)
Ki 240000±n/a nM
Citation Chircorian, ABarrios, AM Inhibition of lysosomal cysteine proteases by chrysotherapeutic compounds: a possible mechanism for the antiarthritic activity of Au(I). Bioorg Med Chem Lett14:5113-6 (2004) 
 
Putative cathepsin L 3
Name:Putative cathepsin L 3
Type:PROTEIN
Mol. Mass.:35182.45
Organism:Paramecium tetraurelia
Description:ChEMBL_302746
Residue:308
BDBM50153289
NameBDBM50153289
Synonyms:CHEMBL182346 disodium aurothiomalate
TypeSmall organic molecule
Emp. Form.C4H3AuO4S
Mol. Mass.344.097
SMILES[O-]C(=O)CC(S[Au])C([O-])=O