Reaction Details
TargetPutative cathepsin L 3
LigandBDBM50153290
Substrate/Competitorn/a
Meas. Tech.ChEMBL_305344 (CHEMBL832724)
IC50 40000±n/a nM
Citation Chircorian, ABarrios, AM Inhibition of lysosomal cysteine proteases by chrysotherapeutic compounds: a possible mechanism for the antiarthritic activity of Au(I). Bioorg Med Chem Lett14:5113-6 (2004) 
 
Putative cathepsin L 3
Name:Putative cathepsin L 3
Type:PROTEIN
Mol. Mass.:35182.45
Organism:Paramecium tetraurelia
Description:ChEMBL_302746
Residue:308
BDBM50153290
NameBDBM50153290
Synonyms:CHEMBL182062 gold chloride sodium hydrochloroauric acid, sodium salt sodium chloroaurate sodium gold(III) chloride sodium tetrachloroaurate sodium tetrachloroaurate(III) tetrachloroauric(3+) acid, sodium salt
TypeSmall organic molecule
Emp. Form.AuCl3
Mol. Mass.303.326
SMILESCl[Au](Cl)Cl