Reaction Details
TargetSodium/glucose cotransporter 1
LigandBDBM50153303
Substrate/Competitorn/a
Meas. Tech.ChEMBL_308699 (CHEMBL834934)
Ki 4380±n/a nM
Citation Dudash, JZhang, XZeck, REJohnson, SGCox, GGConway, BRRybczynski, PJDemarest, KT Glycosylated dihydrochalcones as potent and selective sodium glucose co-transporter 2 (SGLT2) inhibitors. Bioorg Med Chem Lett14:5121-5 (2004) 
 
Sodium/glucose cotransporter 1
Name:Sodium/glucose cotransporter 1
Type:Protein
Mol. Mass.:73503.78
Organism:Homo sapiens (Human)
Description:P13866
Residue:664
BDBM50153303
NameBDBM50153303
Synonyms:3-Furan-3-yl-1-[2-hydroxy-4-methyl-6-(3,4,5-trihydroxy-6-hydroxymethyl-tetrahydro-pyran-2-yloxy)-phenyl]-propan-1-one | CHEMBL184530
TypeSmall organic molecule
Emp. Form.C20H24O9
Mol. Mass.408.3992
SMILESCc1cc(O)c(C(=O)CCc2ccoc2)c(O[C@@H]2O[C@H](CO)[C@@H](O)[C@H](O)[C@H]2O)c1