Reaction Details
TargetSodium/glucose cotransporter 1
LigandBDBM50153296
Substrate/Competitorn/a
Meas. Tech.ChEMBL_308699 (CHEMBL834934)
Ki 4780±n/a nM
Citation Dudash, JZhang, XZeck, REJohnson, SGCox, GGConway, BRRybczynski, PJDemarest, KT Glycosylated dihydrochalcones as potent and selective sodium glucose co-transporter 2 (SGLT2) inhibitors. Bioorg Med Chem Lett14:5121-5 (2004) 
 
Sodium/glucose cotransporter 1
Name:Sodium/glucose cotransporter 1
Type:Protein
Mol. Mass.:73503.78
Organism:Homo sapiens (Human)
Description:P13866
Residue:664
BDBM50153296
NameBDBM50153296
Synonyms:1-[4-Chloro-2-hydroxy-6-(3,4,5-trihydroxy-6-hydroxymethyl-tetrahydro-pyran-2-yloxy)-phenyl]-3-naphthalen-2-yl-propan-1-one | CHEMBL186823
TypeSmall organic molecule
Emp. Form.C25H25ClO8
Mol. Mass.488.914
SMILESOC[C@H]1O[C@@H](Oc2cc(Cl)cc(O)c2C(=O)CCc2ccc3ccccc3c2)[C@H](O)[C@@H](O)[C@@H]1O