Reaction Details
TargetSodium/glucose cotransporter 2
LigandBDBM50153307
Substrate/Competitorn/a
Meas. Tech.ChEMBL_308700 (CHEMBL834935)
Ki 150±n/a nM
Citation Dudash, JZhang, XZeck, REJohnson, SGCox, GGConway, BRRybczynski, PJDemarest, KT Glycosylated dihydrochalcones as potent and selective sodium glucose co-transporter 2 (SGLT2) inhibitors. Bioorg Med Chem Lett14:5121-5 (2004) 
 
Sodium/glucose cotransporter 2
Name:Sodium/glucose cotransporter 2
Type:Protein
Mol. Mass.:72902.00
Organism:Homo sapiens (Human)
Description:P31639
Residue:672
BDBM50153307
NameBDBM50153307
Synonyms:1-[2-Hydroxy-4-isopropyl-6-(3,4,5-trihydroxy-6-hydroxymethyl-tetrahydro-pyran-2-yloxy)-phenyl]-3-naphthalen-2-yl-propan-1-one | CHEMBL183790
TypeSmall organic molecule
Emp. Form.C28H32O8
Mol. Mass.496.5489
SMILESCC(C)c1cc(O)c(C(=O)CCc2ccc3ccccc3c2)c(O[C@@H]2O[C@H](CO)[C@@H](O)[C@H](O)[C@H]2O)c1