Reaction Details
TargetGlucocorticoid receptor
LigandBDBM50153504
Substrate/Competitorn/a
Meas. Tech.ChEMBL_305576 (CHEMBL828024)
IC50 2.3±n/a nM
Citation Shah, NScanlan, TS Design and evaluation of novel nonsteroidal dissociating glucocorticoid receptor ligands. Bioorg Med Chem Lett14:5199-203 (2004) 
 
Glucocorticoid receptor
Name:Glucocorticoid receptor
Type:Enzyme Catalytic Domain
Mol. Mass.:87556.83
Organism:RAT
Description:Glucocorticoid 0 RAT::P06536
Residue:795
BDBM50153504
NameBDBM50153504
Synonyms:CHEMBL366093 | [(4aR,5S)-1-(4-Fluoro-phenyl)-4a-methyl-4,4a,5,6,7,8-hexahydro-1H-benzo[f]indazol-5-yl]-(3-methoxy-phenyl)-methanol
TypeSmall organic molecule
Emp. Form.C26H27FN2O2
Mol. Mass.418.5032
SMILESCOc1cccc(c1)C(O)[C@H]1CCCC2=Cc3c(C[C@]12C)cnn3-c1ccc(F)cc1