Reaction Details
TargetGlucocorticoid receptor
LigandBDBM50153516
Substrate/Competitorn/a
Meas. Tech.ChEMBL_305277 (CHEMBL832826)
IC50 2100±n/a nM
Citation Shah, NScanlan, TS Design and evaluation of novel nonsteroidal dissociating glucocorticoid receptor ligands. Bioorg Med Chem Lett14:5199-203 (2004) 
 
Glucocorticoid receptor
Name:Glucocorticoid receptor
Type:Enzyme
Mol. Mass.:85656.87
Organism:Homo sapiens (Human)
Description:P04150
Residue:777
BDBM50153516
NameBDBM50153516
Synonyms:5-(Hydroxy-phenyl-methyl)-4a-methyl-4,4a,5,6,7,8-hexahydro-3H-naphthalen-2-one | CHEMBL186893
TypeSmall organic molecule
Emp. Form.C18H22O2
Mol. Mass.270.3661
SMILESCC12CCC(=O)C=C1CCCC2C(O)c1ccccc1