Reaction Details
TargetSodium-dependent serotonin transporter
LigandBDBM50153629
Substrate/Competitorn/a
Meas. Tech.ChEMBL_302824 (CHEMBL839613)
Ki 0.2±n/a nM
Citation Gilbert, AMColeman, TKodah, JMewshaw, REScerni, RSchechter, LESmith, DLAndree, TH Novel aryloxy-8-azabicyclo[3.2.1]oct-3-enes with 5-HT transporter and 5-HT1A affinity. Bioorg Med Chem Lett14:5281-4 (2004) 
 
Sodium-dependent serotonin transporter
Name:Sodium-dependent serotonin transporter
Type:Multi-pass membrane protein
Mol. Mass.:70168.43
Organism:Rattus norvegicus (rat)
Description:P31652
Residue:630
BDBM50153629
NameBDBM50153629
Synonyms:4-[2-(3-Naphthalen-2-yl-8-aza-bicyclo[3.2.1]oct-2-en-8-yl)-ethoxy]-1H-indole | CHEMBL185624
TypeSmall organic molecule
Emp. Form.C27H26N2O
Mol. Mass.394.5081
SMILESC(CN1C2CCC1C=C(C2)c1ccc2ccccc2c1)Oc1cccc2[nH]ccc12