Reaction Details
TargetKelch-like ECH-associated protein 1
LigandBDBM50584859
Substrate/Competitorn/a
Meas. Tech.ChEMBL_2160772 (CHEMBL5045522)
Kd 36±n/a nM
Citation Begnini, FGeschwindner, SJohansson, PWissler, LLewis, RJDanelius, ELuttens, AMatricon, PCarlsson, JLenders, SKönig, BFriedel, ASjö, PSchiesser, SKihlberg, J Importance of Binding Site Hydration and Flexibility Revealed When Optimizing a Macrocyclic Inhibitor of the Keap1-Nrf2 Protein-Protein Interaction. J Med Chem65:3473-3517 (2022) 
 
Kelch-like ECH-associated protein 1
Name:Kelch-like ECH-associated protein 1
Type:PROTEIN
Mol. Mass.:69664.53
Organism:Homo sapiens (Human)
Description:ChEMBL_107924
Residue:624
BDBM50584859
NameBDBM50584859
Synonyms:CHEMBL5070465
TypeSmall organic molecule
Emp. Form.C31H36N4O9S
Mol. Mass.640.704
SMILESCOc1cc(ccc1C(O)=O)-c1cccc2c1CSC[C@@H](NC(=O)[C@@H](COC2=O)NC(=O)[C@@H]1CCCN1C(C)=O)C(=O)N(C)C