Reaction Details
TargetKelch-like ECH-associated protein 1
LigandBDBM50584857
Substrate/Competitorn/a
Meas. Tech.ChEMBL_2160773 (CHEMBL5045523)
Kd 27±n/a nM
Citation Begnini, FGeschwindner, SJohansson, PWissler, LLewis, RJDanelius, ELuttens, AMatricon, PCarlsson, JLenders, SKönig, BFriedel, ASjö, PSchiesser, SKihlberg, J Importance of Binding Site Hydration and Flexibility Revealed When Optimizing a Macrocyclic Inhibitor of the Keap1-Nrf2 Protein-Protein Interaction. J Med Chem65:3473-3517 (2022) 
 
Kelch-like ECH-associated protein 1
Name:Kelch-like ECH-associated protein 1
Type:PROTEIN
Mol. Mass.:69664.53
Organism:Homo sapiens (Human)
Description:ChEMBL_107924
Residue:624
BDBM50584857
NameBDBM50584857
Synonyms:CHEMBL5089816
TypeSmall organic molecule
Emp. Form.C30H32F2N4O8S
Mol. Mass.646.659
SMILESCN(C)C(=O)[C@H]1CSCc2c(cccc2C(=O)OC[C@@H](NC(=O)[C@@H]2CCCN2C(C)=O)C(=O)N1)-c1cc(F)c(C(O)=O)c(F)c1