Reaction Details
TargetMetabotropic glutamate receptor 2
LigandBDBM50153743
Substrate/Competitorn/a
Meas. Tech.ChEMBL_304322 (CHEMBL829294)
EC50 380±n/a nM
Citation Pinkerton, ABCube, RVHutchinson, JHRowe, BASchaffhauser, HZhao, XDaggett, LPVernier, JM Allosteric potentiators of the metabotropic glutamate receptor 2 (mGlu2). Part 1: Identification and synthesis of phenyl-tetrazolyl acetophenones. Bioorg Med Chem Lett14:5329-32 (2004) 
 
Metabotropic glutamate receptor 2
Name:Metabotropic glutamate receptor 2
Type:Enzyme
Mol. Mass.:95584.88
Organism:Homo sapiens (Human)
Description:Q14416
Residue:872
BDBM50153743
NameBDBM50153743
Synonyms:1-(2-Hydroxy-3-methyl-4-{4-[4-(2H-tetrazol-5-yl)-phenoxy]-butoxy}-phenyl)-propan-1-one | CHEMBL185602
TypeSmall organic molecule
Emp. Form.C21H24N4O4
Mol. Mass.396.4397
SMILESCCC(=O)c1ccc(OCCCCOc2ccc(cc2)-c2nnn[nH]2)c(C)c1O