Reaction Details
TargetMisshapen-like kinase 1
LigandBDBM50585046
Substrate/Competitorn/a
Meas. Tech.ChEMBL_2161423 (CHEMBL5046173)
IC50 115±n/a nM
Citation Powell, CEHatcher, JMJiang, JVatsan, PSChe, JGray, NS Selective Macrocyclic Inhibitors of DYRK1A/B. ACS Med Chem Lett13:577-585 (2022) 
 
Misshapen-like kinase 1
Name:Misshapen-like kinase 1
Type:PROTEIN
Mol. Mass.:149838.92
Organism:Homo sapiens (Human)
Description:ChEMBL_793919
Residue:1332
BDBM50585046
NameBDBM50585046
Synonyms:CHEMBL5086263
TypeSmall organic molecule
Emp. Form.C22H18F4N8O
Mol. Mass.486.4249
SMILESCN1Cc2nn(C)c(C#N)c2-c2cnc3[nH]c(F)c(-c4cn(CCCC1=O)nc4C(F)(F)F)c3c2