Reaction Details
TargetCytochrome P450 1A1
LigandBDBM50585332
Substrate/Competitorn/a
Meas. Tech.ChEMBL_2162106 (CHEMBL5046967)
Ki 300±n/a nM
Citation Bouzriba, CChavez Alvarez, ACGagné-Boulet, MOuellette, VLacroix, JCôté, MFC-Gaudreault, RFortin, S Branched alkyl of phenyl 4-(2-oxo-3-alkylimidazolidin-1-yl)benzenesulfonates as unique cytochrome P450 1A1-activated antimitotic prodrugs: Biological evaluation and mechanism of bioactivation. Eur J Med Chem229:0 (2022) 
 
Cytochrome P450 1A1
Name:Cytochrome P450 1A1
Type:Protein
Mol. Mass.:58177.23
Organism:Homo sapiens (Human)
Description:P04798
Residue:512
BDBM50585332
NameBDBM50585332
Synonyms:CHEMBL5077719
TypeSmall organic molecule
Emp. Form.C19H20Br2N2O4S
Mol. Mass.532.246
SMILESCC(C)CN1CCN(C1=O)c1ccc(cc1)S(=O)(=O)Oc1cc(Br)cc(Br)c1