Reaction Details
TargetCytochrome P450 1A1
LigandBDBM50585333
Substrate/Competitorn/a
Meas. Tech.ChEMBL_2162106 (CHEMBL5046967)
Ki 1700±n/a nM
Citation Bouzriba, CChavez Alvarez, ACGagné-Boulet, MOuellette, VLacroix, JCôté, MFC-Gaudreault, RFortin, S Branched alkyl of phenyl 4-(2-oxo-3-alkylimidazolidin-1-yl)benzenesulfonates as unique cytochrome P450 1A1-activated antimitotic prodrugs: Biological evaluation and mechanism of bioactivation. Eur J Med Chem229:0 (2022) 
 
Cytochrome P450 1A1
Name:Cytochrome P450 1A1
Type:Protein
Mol. Mass.:58177.23
Organism:Homo sapiens (Human)
Description:P04798
Residue:512
BDBM50585333
NameBDBM50585333
Synonyms:CHEMBL5084275
TypeSmall organic molecule
Emp. Form.C22H28N2O7S
Mol. Mass.464.532
SMILESCOc1cc(OS(=O)(=O)c2ccc(cc2)N2CCN(CC(C)C)C2=O)cc(OC)c1OC