Reaction Details
TargetSodium-dependent dopamine transporter
LigandBDBM50110577
Substrate/Competitorn/a
Meas. Tech.ChEMBL_303446 (CHEMBL839706)
Ki 840±n/a nM
Citation Kung, HFNewman, SChoi, SROya, SHou, CZhuang, ZPActon, PDPlössl, KWinkler, JKung, MP 2-(2-(dimethylaminomethyl)phenoxy)-5-iodophenylamine: an improved serotonin transporter imaging agent. J Med Chem47:5258-64 (2004) 
 
Sodium-dependent dopamine transporter
Name:Sodium-dependent dopamine transporter
Type:Multi-pass membrane protein
Mol. Mass.:68497.11
Organism:Homo sapiens (Human)
Description:Q01959
Residue:620
BDBM50110577
NameBDBM50110577
Synonyms:2-(2-((dimethylamino)methyl)phenylthio)-5-iodoaniline CHEMBL23034 | CHEMBL2314218
TypeSmall organic molecule
Emp. Form.C15H17IN2S
Mol. Mass.384.278
SMILESCN(C)Cc1ccccc1Sc1ccc(I)cc1N