Reaction Details
TargetReverse transcriptase/RNaseH
LigandBDBM50115579
Substrate/Competitorn/a
Meas. Tech.ChEMBL_306401 (CHEMBL828742)
IC50 25000±n/a nM
Citation Maurin, CBailly, FBuisine, EVezin, HMbemba, GMouscadet, JFCotelle, P Spectroscopic studies of diketoacids-metal interactions. A probing tool for the pharmacophoric intermetallic distance in the HIV-1 integrase active site. J Med Chem47:5583-6 (2004) 
 
Reverse transcriptase/RNaseH
Name:Reverse transcriptase/RNaseH
Type:PROTEIN
Mol. Mass.:65229.15
Organism:Human immunodeficiency virus 1
Description:ChEMBL_1473730
Residue:566
BDBM50115579
NameBDBM50115579
Synonyms:(Z)-2-hydroxy-4-oxo-4-phenyl-but-2-enoic acid 2-Hydroxy-4-oxo-4-phenyl-but-2-enoic acid (0.25H2O) CHEMBL19332 Sacchettini_CTRL
TypeSmall organic molecule
Emp. Form.C10H8O4
Mol. Mass.192.1681
SMILESOC(=O)C(=O)CC(=O)c1ccccc1