Reaction Details
TargetMetabotropic glutamate receptor 5
LigandBDBM50154997
Substrate/Competitorn/a
Meas. Tech.ChEMBL_303753 (CHEMBL829796)
Ki 2±n/a nM
Citation Poon, SFEastman, BWChapman, DFChung, JCramer, MHoltz, GCosford, NDSmith, ND 3-[3-Fluoro-5-(5-pyridin-2-yl-2H-tetrazol-2-yl)phenyl]-4-methylpyridine: a highly potent and orally bioavailable metabotropic glutamate subtype 5 (mGlu5) receptor antagonist. Bioorg Med Chem Lett14:5477-80 (2004) 
 
Metabotropic glutamate receptor 5
Name:Metabotropic glutamate receptor 5
Type:Enzyme
Mol. Mass.:131900.14
Organism:Rattus norvegicus (Rat)
Description:P31424
Residue:1203
BDBM50154997
NameBDBM50154997
Synonyms:3-[3-Fluoro-5-(5-pyridin-2-yl-tetrazol-2-yl)-phenyl]-4-methyl-pyridine | CHEMBL361681
TypeSmall organic molecule
Emp. Form.C18H13FN6
Mol. Mass.332.3344
SMILESCc1ccncc1-c1cc(F)cc(c1)-n1nnc(n1)-c1ccccn1