Reaction Details
TargetAldehyde dehydrogenase family 1 member A3
LigandBDBM69358
Substrate/Competitorn/a
Meas. Tech.ChEMBL_2164374 (CHEMBL5049235)
IC50 270±n/a nM
Citation Ibrahim, AIMBatlle, ESneha, SJiménez, RPequerul, RParés, XRüngeler, TJha, VTuccinardi, TSadiq, MFrame, FMaitland, NJFarrés, JPors, K Expansion of the 4-(Diethylamino)benzaldehyde Scaffold to Explore the Impact on Aldehyde Dehydrogenase Activity and Antiproliferative Activity in Prostate Cancer. J Med Chem65:3833-3848 (2022) 
 
Aldehyde dehydrogenase family 1 member A3
Name:Aldehyde dehydrogenase family 1 member A3
Type:PROTEIN
Mol. Mass.:56110.85
Organism:Homo sapiens (Human)
Description:ChEMBL_109700
Residue:512
BDBM69358
NameBDBM69358
Synonyms:3-nitro-4-(1-pyrrolidinyl)benzaldehyde 3-nitro-4-pyrrolidin-1-ylbenzaldehyde MLS001005465 cid_599518
TypeSmall organic molecule
Emp. Form.C11H12N2O3
Mol. Mass.220.2246
SMILES[O-][N+](=O)c1cc(C=O)ccc1N1CCCC1