Reaction Details
TargetAldehyde dehydrogenase family 1 member A3
LigandBDBM50585951
Substrate/Competitorn/a
Meas. Tech.ChEMBL_2164374 (CHEMBL5049235)
IC50 300±n/a nM
Citation Ibrahim, AIMBatlle, ESneha, SJiménez, RPequerul, RParés, XRüngeler, TJha, VTuccinardi, TSadiq, MFrame, FMaitland, NJFarrés, JPors, K Expansion of the 4-(Diethylamino)benzaldehyde Scaffold to Explore the Impact on Aldehyde Dehydrogenase Activity and Antiproliferative Activity in Prostate Cancer. J Med Chem65:3833-3848 (2022) 
 
Aldehyde dehydrogenase family 1 member A3
Name:Aldehyde dehydrogenase family 1 member A3
Type:PROTEIN
Mol. Mass.:56110.85
Organism:Homo sapiens (Human)
Description:ChEMBL_109700
Residue:512
BDBM50585951
NameBDBM50585951
Synonyms:CHEMBL5086460
TypeSmall organic molecule
Emp. Form.C13H17NO
Mol. Mass.203.2802
SMILESCc1cc(C=O)ccc1N1CCCCC1