Reaction Details
TargetAldehyde dehydrogenase family 1 member A3
LigandBDBM50585953
Substrate/Competitorn/a
Meas. Tech.ChEMBL_2164374 (CHEMBL5049235)
IC50 550±n/a nM
Citation Ibrahim, AIMBatlle, ESneha, SJiménez, RPequerul, RParés, XRüngeler, TJha, VTuccinardi, TSadiq, MFrame, FMaitland, NJFarrés, JPors, K Expansion of the 4-(Diethylamino)benzaldehyde Scaffold to Explore the Impact on Aldehyde Dehydrogenase Activity and Antiproliferative Activity in Prostate Cancer. J Med Chem65:3833-3848 (2022) 
 
Aldehyde dehydrogenase family 1 member A3
Name:Aldehyde dehydrogenase family 1 member A3
Type:PROTEIN
Mol. Mass.:56110.85
Organism:Homo sapiens (Human)
Description:ChEMBL_109700
Residue:512
BDBM50585953
NameBDBM50585953
Synonyms:CHEMBL5087589
TypeSmall organic molecule
Emp. Form.C13H18ClNO
Mol. Mass.239.741
SMILESCCCN(CCC)c1ccc(C=O)cc1Cl