Reaction Details
TargetKappa-type opioid receptor
LigandBDBM50155490
Substrate/Competitorn/a
Meas. Tech.ChEMBL_302680 (CHEMBL876693)
Ki 35±n/a nM
Citation Tuthill, PASeida, PRBarker, WCassel, JABelanger, SDeHaven, RNKoblish, MGottshall, SLLittle, PJDeHaven-Hudkins, DLDolle, RE Azepinone as a conformational constraint in the design of kappa-opioid receptor agonists. Bioorg Med Chem Lett14:5693-7 (2004) 
 
Kappa-type opioid receptor
Name:Kappa-type opioid receptor
Type:G Protein-Coupled Receptor (GPCR)
Mol. Mass.:42648.76
Organism:Homo sapiens (Human)
Description:P41145
Residue:380
BDBM50155490
NameBDBM50155490
Synonyms:(R)-3-(4-Chloro-phenyl)-1-(1-phenyl-2-pyrrolidin-1-yl-ethyl)-1,3,4,7-tetrahydro-azepin-2-one | CHEMBL364879
TypeSmall organic molecule
Emp. Form.C24H27ClN2O
Mol. Mass.394.937
SMILESClc1ccc(cc1)[C@H]1CC=CCN(C(CN2CCCC2)c2ccccc2)C1=O