Reaction Details
TargetKappa-type opioid receptor
LigandBDBM50155491
Substrate/Competitorn/a
Meas. Tech.ChEMBL_302680 (CHEMBL876693)
Ki 1900±n/a nM
Citation Tuthill, PASeida, PRBarker, WCassel, JABelanger, SDeHaven, RNKoblish, MGottshall, SLLittle, PJDeHaven-Hudkins, DLDolle, RE Azepinone as a conformational constraint in the design of kappa-opioid receptor agonists. Bioorg Med Chem Lett14:5693-7 (2004) 
 
Kappa-type opioid receptor
Name:Kappa-type opioid receptor
Type:G Protein-Coupled Receptor (GPCR)
Mol. Mass.:42648.76
Organism:Homo sapiens (Human)
Description:P41145
Residue:380
BDBM50155491
NameBDBM50155491
Synonyms:1-(1-Phenyl-2-pyrrolidin-1-yl-ethyl)-3-[3-(pyrrolidine-1-sulfonyl)-phenyl]-1,3,4,7-tetrahydro-azepin-2-one | CHEMBL185964
TypeSmall organic molecule
Emp. Form.C28H35N3O3S
Mol. Mass.493.661
SMILESO=C1C(CC=CCN1C(CN1CCCC1)c1ccccc1)c1cccc(c1)S(=O)(=O)N1CCCC1