Reaction Details
TargetKappa-type opioid receptor
LigandBDBM50155492
Substrate/Competitorn/a
Meas. Tech.ChEMBL_302680 (CHEMBL876693)
Ki 22±n/a nM
Citation Tuthill, PASeida, PRBarker, WCassel, JABelanger, SDeHaven, RNKoblish, MGottshall, SLLittle, PJDeHaven-Hudkins, DLDolle, RE Azepinone as a conformational constraint in the design of kappa-opioid receptor agonists. Bioorg Med Chem Lett14:5693-7 (2004) 
 
Kappa-type opioid receptor
Name:Kappa-type opioid receptor
Type:G Protein-Coupled Receptor (GPCR)
Mol. Mass.:42648.76
Organism:Homo sapiens (Human)
Description:P41145
Residue:380
BDBM50155492
NameBDBM50155492
Synonyms:3-(4-Methoxy-phenyl)-1-(1-phenyl-2-pyrrolidin-1-yl-ethyl)-1,3,4,7-tetrahydro-azepin-2-one | CHEMBL183533
TypeSmall organic molecule
Emp. Form.C25H30N2O2
Mol. Mass.390.5179
SMILESCOc1ccc(cc1)C1CC=CCN(C(CN2CCCC2)c2ccccc2)C1=O