Reaction Details
TargetMu-type opioid receptor
LigandBDBM50007377
Substrate/Competitorn/a
Meas. Tech.ChEMBL_302611 (CHEMBL839660)
Ki 53±n/a nM
Citation Tuthill, PASeida, PRBarker, WCassel, JABelanger, SDeHaven, RNKoblish, MGottshall, SLLittle, PJDeHaven-Hudkins, DLDolle, RE Azepinone as a conformational constraint in the design of kappa-opioid receptor agonists. Bioorg Med Chem Lett14:5693-7 (2004) 
 
Mu-type opioid receptor
Name:Mu-type opioid receptor
Type:G Protein-Coupled Receptor (GPCR)
Mol. Mass.:44789.51
Organism:Homo sapiens (Human)
Description:P35372
Residue:400
BDBM50007377
NameBDBM50007377
Synonyms:2-(3,4-Dichloro-phenyl)-N-methyl-N-(1-phenyl-2-pyrrolidin-1-yl-ethyl)-acetamide | CHEMBL320882
TypeSmall organic molecule
Emp. Form.C21H24Cl2N2O
Mol. Mass.391.334
SMILESCN(C(CN1CCCC1)c1ccccc1)C(=O)Cc1ccc(Cl)c(Cl)c1