Reaction Details
TargetKappa-type opioid receptor
LigandBDBM50155494
Substrate/Competitorn/a
Meas. Tech.ChEMBL_302680 (CHEMBL876693)
Ki 0.340000±n/a nM
Citation Tuthill, PASeida, PRBarker, WCassel, JABelanger, SDeHaven, RNKoblish, MGottshall, SLLittle, PJDeHaven-Hudkins, DLDolle, RE Azepinone as a conformational constraint in the design of kappa-opioid receptor agonists. Bioorg Med Chem Lett14:5693-7 (2004) 
 
Kappa-type opioid receptor
Name:Kappa-type opioid receptor
Type:G Protein-Coupled Receptor (GPCR)
Mol. Mass.:42648.76
Organism:Homo sapiens (Human)
Description:P41145
Residue:380
BDBM50155494
NameBDBM50155494
Synonyms:3-(3,4-Dichloro-phenyl)-1-(1-phenyl-2-pyrrolidin-1-yl-ethyl)-1,3,4,7-tetrahydro-azepin-2-one | CHEMBL184811
TypeSmall organic molecule
Emp. Form.C24H26Cl2N2O
Mol. Mass.429.382
SMILESClc1ccc(cc1Cl)C1CC=CCN(C(CN2CCCC2)c2ccccc2)C1=O