Reaction Details
TargetCarbonic anhydrase 2
LigandBDBM50027795
Substrate/Competitorn/a
Meas. Tech.ChEMBL_305698 (CHEMBL828069)
IC50>100000±n/a nM
Citation Innocenti, AAntel, JWurl, MScozzafava, ASupuran, CT Carbonic anhydrase inhibitors: inhibition of human cytosolic isozyme II and mitochondrial isozyme V with a series of benzene sulfonamide derivatives. Bioorg Med Chem Lett14:5703-7 (2004) 
 
Carbonic anhydrase 2
Name:Carbonic anhydrase 2
Type:Enzyme
Mol. Mass.:29250.71
Organism:Homo sapiens (Human)
Description:P00918
Residue:260
BDBM50027795
NameBDBM50027795
Synonyms:1N-amino(imino)methyl-4-amino-1-benzenesulfonamide 4-Amino-N-diaminomethylene-benzenesulfonamide 4-amino-N-[(Z)-amino(imino)methyl]benzenesulfonamide Sulfaguanidine | sulphaguanidine
TypeSmall organic molecule
Emp. Form.C7H10N4O2S
Mol. Mass.214.245
SMILESNC(=N)NS(=O)(=O)c1ccc(N)cc1