Reaction Details
TargetCarbonic anhydrase 5A, mitochondrial
LigandBDBM50155504
Substrate/Competitorn/a
Meas. Tech.ChEMBL_305668 (CHEMBL827937)
IC50 63700±n/a nM
Citation Innocenti, AAntel, JWurl, MScozzafava, ASupuran, CT Carbonic anhydrase inhibitors: inhibition of human cytosolic isozyme II and mitochondrial isozyme V with a series of benzene sulfonamide derivatives. Bioorg Med Chem Lett14:5703-7 (2004) 
 
Carbonic anhydrase 5A, mitochondrial
Name:Carbonic anhydrase 5A, mitochondrial
Type:Enzyme
Mol. Mass.:34755.54
Organism:Homo sapiens (Human)
Description:Human (cloned) isozyme
Residue:305
BDBM50155504
NameBDBM50155504
Synonyms:2-[4-(aminosulfonyl)phenyl]hydrazinecarbothioamide | CHEMBL186636
TypeSmall organic molecule
Emp. Form.C7H10N4O2S2
Mol. Mass.246.31
SMILESNC(=S)NNc1ccc(cc1)S(N)(=O)=O