Reaction Details
TargetCarbonic anhydrase 5A, mitochondrial
LigandBDBM10857
Substrate/Competitorn/a
Meas. Tech.ChEMBL_305668 (CHEMBL827937)
IC50 32000±n/a nM
Citation Innocenti, AAntel, JWurl, MScozzafava, ASupuran, CT Carbonic anhydrase inhibitors: inhibition of human cytosolic isozyme II and mitochondrial isozyme V with a series of benzene sulfonamide derivatives. Bioorg Med Chem Lett14:5703-7 (2004) 
 
Carbonic anhydrase 5A, mitochondrial
Name:Carbonic anhydrase 5A, mitochondrial
Type:Enzyme
Mol. Mass.:34755.54
Organism:Homo sapiens (Human)
Description:Human (cloned) isozyme
Residue:305
BDBM10857
NameBDBM10857
Synonyms:4-aminobenzene-1-sulfonamide Sulfanilamide aromatic/heteroaromatic sulfonamide 2 | halogenosulfanilamide deriv. 5a
TypeSmall organic molecule
Emp. Form.C6H8N2O2S
Mol. Mass.172.205
SMILESNc1ccc(cc1)S(N)(=O)=O