Reaction Details
TargetCoagulation factor X
LigandBDBM50134404
Substrate/Competitorn/a
Meas. Tech.ChEMBL_305561 (CHEMBL828580)
IC50 5600±n/a nM
Citation Mederski, WWCezanne, Bvan Amsterdam, CBühring, KUDorsch, DGleitz, JMärz, JTsaklakidis, C Chlorothiophenecarboxamides as P1 surrogates of inhibitors of blood coagulation factor Xa. Bioorg Med Chem Lett14:5817-22 (2004) 
 
Coagulation factor X
Name:Coagulation factor X
Type:Enzyme
Mol. Mass.:54726.60
Organism:Homo sapiens (Human)
Description:n/a
Residue:488
BDBM50134404
NameBDBM50134404
Synonyms:(R)-2-[3-(4-Chloro-phenyl)-ureido]-pentanoic acid [4-(3-oxo-morpholin-4-yl)-phenyl]-amide CHEMBL122023
TypeSmall organic molecule
Emp. Form.C22H25ClN4O4
Mol. Mass.444.911
SMILESCCC[C@@H](NC(=O)Nc1ccc(Cl)cc1)C(=O)Nc1ccc(cc1)N1CCOCC1=O