Reaction Details
TargetMetabotropic glutamate receptor 2
LigandBDBM50155699
Substrate/Competitorn/a
Meas. Tech.ChEMBL_304250 (CHEMBL829721)
EC50 558±n/a nM
Citation Pinkerton, ABCube, RVHutchinson, JHJames, JKGardner, MFSchaffhauser, HRowe, BADaggett, LPVernier, JM Allosteric potentiators of the metabotropic glutamate receptor 2 (mGlu2). Part 2: 4-thiopyridyl acetophenones as non-tetrazole containing mGlu2 receptor potentiators. Bioorg Med Chem Lett14:5867-72 (2004) 
 
Metabotropic glutamate receptor 2
Name:Metabotropic glutamate receptor 2
Type:Enzyme
Mol. Mass.:95584.88
Organism:Homo sapiens (Human)
Description:Q14416
Residue:872
BDBM50155699
NameBDBM50155699
Synonyms:1-{3-Bromo-4-[4-(2,3-difluoro-phenoxy)-butoxy]-2-hydroxy-phenyl}-3-methyl-butan-1-one | CHEMBL181921
TypeSmall organic molecule
Emp. Form.C21H23BrF2O4
Mol. Mass.457.306
SMILESCC(C)CC(=O)c1ccc(OCCCCOc2cccc(F)c2F)c(Br)c1O