Reaction Details
TargetMetabotropic glutamate receptor 2
LigandBDBM50155710
Substrate/Competitorn/a
Meas. Tech.ChEMBL_304250 (CHEMBL829721)
EC50 575±n/a nM
Citation Pinkerton, ABCube, RVHutchinson, JHJames, JKGardner, MFSchaffhauser, HRowe, BADaggett, LPVernier, JM Allosteric potentiators of the metabotropic glutamate receptor 2 (mGlu2). Part 2: 4-thiopyridyl acetophenones as non-tetrazole containing mGlu2 receptor potentiators. Bioorg Med Chem Lett14:5867-72 (2004) 
 
Metabotropic glutamate receptor 2
Name:Metabotropic glutamate receptor 2
Type:Enzyme
Mol. Mass.:95584.88
Organism:Homo sapiens (Human)
Description:Q14416
Residue:872
BDBM50155710
NameBDBM50155710
Synonyms:1-{3-Bromo-2-hydroxy-4-[4-(pyridin-3-yloxy)-butoxy]-phenyl}-3-methyl-butan-1-one | CHEMBL182668
TypeSmall organic molecule
Emp. Form.C20H24BrNO4
Mol. Mass.422.313
SMILESCC(C)CC(=O)c1ccc(OCCCCOc2cccnc2)c(Br)c1O