Reaction Details
TargetAndrogen receptor
LigandBDBM50155875
Substrate/Competitorn/a
Meas. Tech.ChEMBL_306281 (CHEMBL828424)
IC50 90±n/a nM
Citation Cogan, PSKoch, TH Studies of targeting and intracellular trafficking of an anti-androgen doxorubicin-formaldehyde conjugate in PC-3 prostate cancer cells bearing androgen receptor-GFP chimera. J Med Chem47:5690-9 (2004) 
 
Androgen receptor
Name:Androgen receptor
Type:Receptor
Mol. Mass.:99185.27
Organism:Homo sapiens (Human)
Description:CHO cells were stably transfected with human AR gene.
Residue:920
BDBM50155875
NameBDBM50155875
Synonyms:CHEMBL264131 | Doxorubicin-Formaldehyde Conjugate
TypeSmall organic molecule
Emp. Form.C53H50F3N5O16
Mol. Mass.1069.9832
SMILESCOc1cccc2C(=O)c3c(O)c4C[C@](O)(CC(OC5C[C@H](NCNC(=O)c6cc(COCC#CCN7C(=O)N(C(=O)C7(C)C)c7ccc(C#N)c(c7)C(F)(F)F)ccc6O)[C@H](O)[C@H](C)O5)c4c(O)c3C(=O)c12)C(=O)CO