Reaction Details
TargetMetabotropic glutamate receptor 5
LigandBDBM50156073
Substrate/Competitorn/a
Meas. Tech.ChEMBL_304169 (CHEMBL830007)
EC50 65±n/a nM
Citation Lindsley, CWWisnoski, DDLeister, WHO'brien, JALemaire, WWilliams, DLBurno, MSur, CKinney, GGPettibone, DJTiller, PRSmith, SDuggan, MEHartman, GDConn, PJHuff, JR Discovery of positive allosteric modulators for the metabotropic glutamate receptor subtype 5 from a series of N-(1,3-diphenyl-1H- pyrazol-5-yl)benzamides that potentiate receptor function in vivo. J Med Chem47:5825-8 (2004) 
 
Metabotropic glutamate receptor 5
Name:Metabotropic glutamate receptor 5
Type:Enzyme
Mol. Mass.:131900.14
Organism:Rattus norvegicus (Rat)
Description:P31424
Residue:1203
BDBM50156073
NameBDBM50156073
Synonyms:CHEMBL194051 | N-(2,5-Diphenyl-2H-pyrazol-3-yl)-3-fluoro-benzamide
TypeSmall organic molecule
Emp. Form.C22H16FN3O
Mol. Mass.357.3803
SMILESFc1cccc(c1)C(=O)Nc1cc(nn1-c1ccccc1)-c1ccccc1