Reaction Details
TargetGABA-A receptor; alpha-2/beta-3/gamma-2
LigandBDBM50156083
Substrate/Competitorn/a
Meas. Tech.ChEMBL_303794 (CHEMBL829843)
Ki 0.85±n/a nM
Citation Chambers, MSAtack, JRCarling, RWCollinson, NCook, SMDawson, GRFerris, PHobbs, SCO'connor, DMarshall, GRycroft, WMacleod, AM An orally bioavailable, functionally selective inverse agonist at the benzodiazepine site of GABAA alpha5 receptors with cognition enhancing properties. J Med Chem47:5829-32 (2004) 
 
GABA-A receptor; alpha-2/beta-3/gamma-2
Name:GABA-A receptor; alpha-2/beta-3/gamma-2
Type:n/a
Mol. Mass.:n/a
Description:ASSAY_ID of ChEMBL is 2148174
Components:This complex has 3 components.
Component 1
Name:Gamma-aminobutyric acid receptor subunit gamma-2
Synonyms:GABA(A) receptor subunit gamma-2 GBRG2_HUMAN
Type:PROTEIN
Mol. Mass.:54172.74
Organism:Homo sapiens (Human)
Description:EBI_217
Residue:467
Component 2
Name:Gamma-aminobutyric acid receptor subunit beta-3
Synonyms:GABA A receptor alpha-4/beta-3/gamma-2 GABA-A receptor GBRB3_HUMAN | agonist GABA site
Type:PROTEIN
Mol. Mass.:54130.51
Organism:Homo sapiens (Human)
Description:ChEMBL_448071
Residue:473
Component 3
Name:Gamma-aminobutyric acid receptor subunit alpha-2
Synonyms:GABA receptor alpha-2 subunit GBRA2_HUMAN | Gamma-aminobutyric acid receptor subunit alpha-2 (GABRA2)
Type:Protein
Mol. Mass.:51338.78
Organism:Homo sapiens (Human)
Description:P47869
Residue:451
BDBM50156083
NameBDBM50156083
Synonyms:3-tert-Butyl-7-(5-methyl-isoxazol-3-yl)-2-(2-methyl-2H-[1,2,4]triazol-3-ylmethoxy)-pyrazolo[1,5-d][1,2,4]triazine CHEMBL363211
TypeSmall organic molecule
Emp. Form.C17H20N8O2
Mol. Mass.368.3931
SMILESCc1cc(no1)-c1nncc2c(c(OCc3ncnn3C)nn12)C(C)(C)C