Reaction Details
TargetPhenylalanine-4-hydroxylase
LigandBDBM50156156
Substrate/Competitorn/a
Meas. Tech.ChEMBL_302752 (CHEMBL838699)
Ki 7000±n/a nM
Citation Teigen, KDao, KKMcKinney, JAGorren, ACMayer, BFrøystein, NAHaavik, JMartínez, A Tetrahydrobiopterin binding to aromatic amino acid hydroxylases. Ligand recognition and specificity. J Med Chem47:5962-71 (2004) 
 
Phenylalanine-4-hydroxylase
Name:Phenylalanine-4-hydroxylase
Type:PROTEIN
Mol. Mass.:51861.95
Organism:Homo sapiens (Human)
Description:ChEMBL_305560
Residue:452
BDBM50156156
NameBDBM50156156
Synonyms:2-Amino-7-(1,2-dihydroxy-propyl)-5,6,7,8-tetrahydro-1H-pteridin-4-one | CHEMBL187878
TypeSmall organic molecule
Emp. Form.C9H15N5O3
Mol. Mass.241.2471
SMILESCC(O)C(O)C1CNc2c(N1)nc(N)[nH]c2=O