Reaction Details
Target5-hydroxytryptamine receptor 2A
LigandBDBM50098528
Substrate/Competitorn/a
Meas. Tech.ChEMBL_302684 (CHEMBL839446)
Ki 9.2±n/a nM
Citation Glennon, RABondarev, MLKhorana, NYoung, RMay, JAHellberg, MRMcLaughlin, MASharif, NA Beta-oxygenated analogues of the 5-HT2A serotonin receptor agonist 1-(4-bromo-2,5-dimethoxyphenyl)-2-aminopropane. J Med Chem47:6034-41 (2004) 
 
5-hydroxytryptamine receptor 2A
Name:5-hydroxytryptamine receptor 2A
Type:G Protein-Coupled Receptor (GPCR)
Mol. Mass.:52852.05
Organism:Rattus norvegicus (rat)
Description:Rat cortex membranes 5-HT2A receptors.
Residue:471
BDBM50098528
NameBDBM50098528
Synonyms:(R)-2-(2,5-Dimethoxy-phenyl)-1-methyl-ethylamine CHEMBL6737
TypeSmall organic molecule
Emp. Form.C11H17NO2
Mol. Mass.195.2582
SMILESCOc1ccc(OC)c(C[C@@H](C)N)c1