Reaction Details
Target5-hydroxytryptamine receptor 2A
LigandBDBM50156188
Substrate/Competitorn/a
Meas. Tech.ChEMBL_302684 (CHEMBL839446)
Ki 2±n/a nM
Citation Glennon, RABondarev, MLKhorana, NYoung, RMay, JAHellberg, MRMcLaughlin, MASharif, NA Beta-oxygenated analogues of the 5-HT2A serotonin receptor agonist 1-(4-bromo-2,5-dimethoxyphenyl)-2-aminopropane. J Med Chem47:6034-41 (2004) 
 
5-hydroxytryptamine receptor 2A
Name:5-hydroxytryptamine receptor 2A
Type:G Protein-Coupled Receptor (GPCR)
Mol. Mass.:52852.05
Organism:Rattus norvegicus (rat)
Description:Rat cortex membranes 5-HT2A receptors.
Residue:471
BDBM50156188
NameBDBM50156188
Synonyms:2-(4-Bromo-2,5-dimethoxy-phenyl)-2-methoxy-ethylamine | CHEMBL191051
TypeSmall organic molecule
Emp. Form.C11H16BrNO3
Mol. Mass.290.154
SMILESCOC(CN)c1cc(OC)c(Br)cc1OC