Reaction Details
Target5-hydroxytryptamine receptor 2A
LigandBDBM50156190
Substrate/Competitorn/a
Meas. Tech.ChEMBL_302684 (CHEMBL839446)
Ki 20.3±n/a nM
Citation Glennon, RABondarev, MLKhorana, NYoung, RMay, JAHellberg, MRMcLaughlin, MASharif, NA Beta-oxygenated analogues of the 5-HT2A serotonin receptor agonist 1-(4-bromo-2,5-dimethoxyphenyl)-2-aminopropane. J Med Chem47:6034-41 (2004) 
 
5-hydroxytryptamine receptor 2A
Name:5-hydroxytryptamine receptor 2A
Type:G Protein-Coupled Receptor (GPCR)
Mol. Mass.:52852.05
Organism:Rattus norvegicus (rat)
Description:Rat cortex membranes 5-HT2A receptors.
Residue:471
BDBM50156190
NameBDBM50156190
Synonyms:(1R,2S)-2-Amino-1-(4-bromo-2,5-dimethoxy-phenyl)-butan-1-ol | CHEMBL187715
TypeSmall organic molecule
Emp. Form.C12H18BrNO3
Mol. Mass.304.18
SMILESCC[C@H](N)[C@H](O)c1cc(OC)c(Br)cc1OC