Reaction Details
Target5-hydroxytryptamine receptor 2A
LigandBDBM50156193
Substrate/Competitorn/a
Meas. Tech.ChEMBL_310320 (CHEMBL833276)
EC50 100±n/a nM
Citation Glennon, RABondarev, MLKhorana, NYoung, RMay, JAHellberg, MRMcLaughlin, MASharif, NA Beta-oxygenated analogues of the 5-HT2A serotonin receptor agonist 1-(4-bromo-2,5-dimethoxyphenyl)-2-aminopropane. J Med Chem47:6034-41 (2004) 
 
5-hydroxytryptamine receptor 2A
Name:5-hydroxytryptamine receptor 2A
Type:G Protein-Coupled Receptor (GPCR)
Mol. Mass.:52852.05
Organism:Rattus norvegicus (rat)
Description:Rat cortex membranes 5-HT2A receptors.
Residue:471
BDBM50156193
NameBDBM50156193
Synonyms:(1R,2R)-2-Amino-1-(4-bromo-2,5-dimethoxy-phenyl)-propan-1-ol | CHEMBL188709
TypeSmall organic molecule
Emp. Form.C11H16BrNO3
Mol. Mass.290.154
SMILESCOc1cc([C@@H](O)[C@@H](C)N)c(OC)cc1Br