Reaction Details
Target5-hydroxytryptamine receptor 2A
LigandBDBM50156195
Substrate/Competitorn/a
Meas. Tech.ChEMBL_310320 (CHEMBL833276)
EC50 1410±n/a nM
Citation Glennon, RABondarev, MLKhorana, NYoung, RMay, JAHellberg, MRMcLaughlin, MASharif, NA Beta-oxygenated analogues of the 5-HT2A serotonin receptor agonist 1-(4-bromo-2,5-dimethoxyphenyl)-2-aminopropane. J Med Chem47:6034-41 (2004) 
 
5-hydroxytryptamine receptor 2A
Name:5-hydroxytryptamine receptor 2A
Type:G Protein-Coupled Receptor (GPCR)
Mol. Mass.:52852.05
Organism:Rattus norvegicus (rat)
Description:Rat cortex membranes 5-HT2A receptors.
Residue:471
BDBM50156195
NameBDBM50156195
Synonyms:(1S,2S)-2-(4-Bromo-2,5-dimethoxy-phenyl)-2-methoxy-1-methyl-ethylamine | CHEMBL191420
TypeSmall organic molecule
Emp. Form.C12H18BrNO3
Mol. Mass.304.18
SMILESCO[C@H]([C@H](C)N)c1cc(OC)c(Br)cc1OC