Reaction Details
TargetSerine/threonine-protein kinase mTOR
LigandBDBM12915
Substrate/Competitorn/a
Meas. Tech.ChEMBL_305479 (CHEMBL830270)
IC50 2500±n/a nM
Citation Leahy, JJGolding, BTGriffin, RJHardcastle, IRRichardson, CRigoreau, LSmith, GC Identification of a highly potent and selective DNA-dependent protein kinase (DNA-PK) inhibitor (NU7441) by screening of chromenone libraries. Bioorg Med Chem Lett14:6083-7 (2004) 
 
Serine/threonine-protein kinase mTOR
Name:Serine/threonine-protein kinase mTOR
Type:Rapamycin target protein
Mol. Mass.:288917.12
Organism:Homo sapiens (Human)
Description:P42345
Residue:2549
BDBM12915
NameBDBM12915
Synonyms:2-(4-Morpholinyl)-8-phenyl-4H-1-benzopyran-4-one CHEMBL98350 US10308662, Compound LY294002 | US9505780, LY294002
TypeSmall organic molecule
Emp. Form.C19H17NO3
Mol. Mass.307.3432
SMILESO=c1cc(oc2c(cccc12)-c1ccccc1)N1CCOCC1