Reaction Details
TargetP2X purinoceptor 7
LigandBDBM198970
Substrate/Competitorn/a
Meas. Tech.ChEMBL_2170683 (CHEMBL5055817)
Ki 5.6±n/a nM
Citation Hopper, ATJuhl, MHornberg, JBadolo, LKilburn, JPThougaard, ASmagin, GSong, DCalice, LMenon, VDale, EZhang, HCajina, MNattini, MEGandhi, AGrenon, MJones, KKhayrullina, TChandrasena, GThomsen, CZorn, SHBrodbeck, RPoda, SBStaal, RMöller, T Synthesis and Characterization of the Novel Rodent-Active and CNS-Penetrant P2X7 Receptor Antagonist Lu AF27139. J Med Chem64:4891-4902 (2021) 
 
P2X purinoceptor 7
Name:P2X purinoceptor 7
Type:Protein
Mol. Mass.:68602.85
Organism:Homo sapiens (Human)
Description:Q99572
Residue:595
BDBM198970
NameBDBM198970
Synonyms:BDBM199009 US9221832, 34
TypeSmall organic molecule
Emp. Form.C16H12ClF3N2O2
Mol. Mass.356.727
SMILESFC(F)(F)c1cccc(CC(=O)NC2COc3ncccc23)c1Cl