Reaction Details
TargetP2X purinoceptor 7
LigandBDBM50318021
Substrate/Competitorn/a
Meas. Tech.ChEMBL_2170683 (CHEMBL5055817)
Ki 53±n/a nM
Citation Hopper, ATJuhl, MHornberg, JBadolo, LKilburn, JPThougaard, ASmagin, GSong, DCalice, LMenon, VDale, EZhang, HCajina, MNattini, MEGandhi, AGrenon, MJones, KKhayrullina, TChandrasena, GThomsen, CZorn, SHBrodbeck, RPoda, SBStaal, RMöller, T Synthesis and Characterization of the Novel Rodent-Active and CNS-Penetrant P2X7 Receptor Antagonist Lu AF27139. J Med Chem64:4891-4902 (2021) 
 
P2X purinoceptor 7
Name:P2X purinoceptor 7
Type:Protein
Mol. Mass.:68602.85
Organism:Homo sapiens (Human)
Description:Q99572
Residue:595
BDBM50318021
NameBDBM50318021
Synonyms:2-chloro-N-((4,4-difluoro-1-hydroxycyclohexyl)methyl)-5-(5-fluoropyrimidin-2-yl)benzamide | CHEMBL1094153
TypeSmall organic molecule
Emp. Form.C18H17ClF3N3O2
Mol. Mass.399.795
SMILESOC1(CNC(=O)c2cc(ccc2Cl)-c2ncc(F)cn2)CCC(F)(F)CC1