Reaction Details
TargetP2X purinoceptor 7
LigandBDBM50234965
Substrate/Competitorn/a
Meas. Tech.ChEMBL_2170684 (CHEMBL5055818)
Ki 59±n/a nM
Citation Hopper, ATJuhl, MHornberg, JBadolo, LKilburn, JPThougaard, ASmagin, GSong, DCalice, LMenon, VDale, EZhang, HCajina, MNattini, MEGandhi, AGrenon, MJones, KKhayrullina, TChandrasena, GThomsen, CZorn, SHBrodbeck, RPoda, SBStaal, RMöller, T Synthesis and Characterization of the Novel Rodent-Active and CNS-Penetrant P2X7 Receptor Antagonist Lu AF27139. J Med Chem64:4891-4902 (2021) 
 
P2X purinoceptor 7
Name:P2X purinoceptor 7
Type:Protein
Mol. Mass.:68403.50
Organism:Rattus norvegicus (Rat)
Description:Q64663
Residue:595
BDBM50234965
NameBDBM50234965
Synonyms:A-740003 N-(1-(2-cyano-3-(quinolin-5-yl)guanidino)-2,2-dimethylpropyl)-2-(3,4-dimethoxyphenyl)acetamide | N-(1-{[(Cyanoimino)(5-quinolinylamino)methyl]amino}-2,2-dimethylpropyl)-2-(3,4-dimethoxyphenyl)acetamide
TypeSmall organic molecule
Emp. Form.C26H30N6O3
Mol. Mass.474.5548
SMILESCOc1ccc(CC(=O)NC(N=C(NC#N)Nc2cccc3ncccc23)C(C)(C)C)cc1OC