Reaction Details
TargetP2X purinoceptor 7
LigandBDBM50585248
Substrate/Competitorn/a
Meas. Tech.ChEMBL_2170684 (CHEMBL5055818)
Ki 98±n/a nM
Citation Hopper, ATJuhl, MHornberg, JBadolo, LKilburn, JPThougaard, ASmagin, GSong, DCalice, LMenon, VDale, EZhang, HCajina, MNattini, MEGandhi, AGrenon, MJones, KKhayrullina, TChandrasena, GThomsen, CZorn, SHBrodbeck, RPoda, SBStaal, RMöller, T Synthesis and Characterization of the Novel Rodent-Active and CNS-Penetrant P2X7 Receptor Antagonist Lu AF27139. J Med Chem64:4891-4902 (2021) 
 
P2X purinoceptor 7
Name:P2X purinoceptor 7
Type:Protein
Mol. Mass.:68403.50
Organism:Rattus norvegicus (Rat)
Description:Q64663
Residue:595
BDBM50585248
NameBDBM50585248
Synonyms:CHEMBL2338352
TypeSmall organic molecule
Emp. Form.C28H32N4O2S
Mol. Mass.488.644
SMILESO=C(NCC1(CCOCC1)N1CCN(CC1)c1ccccc1)c1cccnc1Sc1ccccc1