Reaction Details
TargetP2X purinoceptor 7
LigandBDBM50237707
Substrate/Competitorn/a
Meas. Tech.ChEMBL_2170685 (CHEMBL5055819)
Ki 60±n/a nM
Citation Hopper, ATJuhl, MHornberg, JBadolo, LKilburn, JPThougaard, ASmagin, GSong, DCalice, LMenon, VDale, EZhang, HCajina, MNattini, MEGandhi, AGrenon, MJones, KKhayrullina, TChandrasena, GThomsen, CZorn, SHBrodbeck, RPoda, SBStaal, RMöller, T Synthesis and Characterization of the Novel Rodent-Active and CNS-Penetrant P2X7 Receptor Antagonist Lu AF27139. J Med Chem64:4891-4902 (2021) 
 
P2X purinoceptor 7
Name:P2X purinoceptor 7
Type:PROTEIN
Mol. Mass.:68405.16
Organism:Mus musculus
Description:ChEMBL_1473824
Residue:595
BDBM50237707
NameBDBM50237707
Synonyms:A-804598 | CHEMBL1628690
TypeSmall organic molecule
Emp. Form.C19H17N5
Mol. Mass.315.3718
SMILESC[C@H](N\C(Nc1cccc2ncccc12)=N\C#N)c1ccccc1