Reaction Details
TargetDual specificity mitogen-activated protein kinase kinase 1
LigandBDBM50156670
Substrate/Competitorn/a
Meas. Tech.ChEMBL_429651 (CHEMBL920483)
IC50 10500±n/a nM
Citation Pagano, MAAndrzejewska, MRuzzene, MSarno, SCesaro, LBain, JElliott, MMeggio, FKazimierczuk, ZPinna, LA Optimization of protein kinase CK2 inhibitors derived from 4,5,6,7-tetrabromobenzimidazole. J Med Chem47:6239-47 (2004) 
 
Dual specificity mitogen-activated protein kinase kinase 1
Name:Dual specificity mitogen-activated protein kinase kinase 1
Type:Other Protein Type
Mol. Mass.:43439.03
Organism:Homo sapiens (Human)
Description:Full-length human MEK-1 was generated by PCR and purified as a fusion protein from Escherichia coli lysates.
Residue:393
BDBM50156670
NameBDBM50156670
Synonyms:2-(dimethylamino)-4,5,6,7-tetrabromo-1H-benzimidazole CHEMBL376505
TypeSmall organic molecule
Emp. Form.C9H7Br4N3
Mol. Mass.476.788
SMILESCN(C)c1nc2c(Br)c(Br)c(Br)c(Br)c2[nH]1